BDBM50153390 CHEMBL361263::Trifluoro-acetate1-(2-fluoro-benzyl)-3-{(S)-2-[4-(1H-imidazol-4-yl)-butylcarbamoyl]-pyrrolidin-1-yl}-3-oxo-propyl-ammonium;
SMILES [NH3+]C(CC(=O)N1CCC[C@H]1C(=O)NCCCCc1cnc[nH]1)Cc1ccccc1F
InChI Key InChIKey=VSIXROQCCXYLFD-OZBJMMHXSA-O
Data  1 IC50
  Tab Delimited (TSV)   2D SDfile   Computed 3D by Vconf -m prep SDfile
Find this compound or compounds like it in BindingDB:
Activity Spreadsheet -- Enzyme Inhibition Constant Data from BindingDB
Found 1 hit for monomerid = 50153390
TargetDipeptidyl peptidase 4(Homo sapiens (Human))
Merck
Curated by ChEMBL
LigandPNGBDBM50153390(CHEMBL361263 | Trifluoro-acetate1-(2-fluoro-benzyl...)
Affinity DataIC50:  1.64E+3nM. Assay description: Inhibition of human recombinant Dipeptidylpeptidase IV
In DepthDetails ArticlePubMed