BDBM50153391 CHEMBL187963::Trifluoro-acetate3-{(S)-2-[4-((R)-1-carboxy-ethoxy)-benzylcarbamoyl]-pyrrolidin-1-yl}-1-(2-fluoro-benzyl)-3-oxo-propyl-ammonium;
SMILES C[C@@H](Oc1ccc(CNC(=O)[C@@H]2CCCN2C(=O)CC([NH3+])Cc2ccccc2F)cc1)C(O)=O
InChI Key InChIKey=HEXLPALBHRZUKM-QXGTWOLJSA-O
Data  1 IC50
  Tab Delimited (TSV)   2D SDfile   Computed 3D by Vconf -m prep SDfile
Find this compound or compounds like it in BindingDB:
Activity Spreadsheet -- Enzyme Inhibition Constant Data from BindingDB
Found 1 hit for monomerid = 50153391
TargetDipeptidyl peptidase 4(Homo sapiens (Human))
Merck
Curated by ChEMBL
LigandPNGBDBM50153391(CHEMBL187963 | Trifluoro-acetate3-{(S)-2-[4-((R)-1...)
Affinity DataIC50:  82nM. Assay description: Inhibition of human recombinant Dipeptidylpeptidase IV
In DepthDetails ArticlePubMed