BDBM50153414 CHEMBL187699::Trifluoro-acetate2-[(S)-2-(4-carboxy-benzylcarbamoyl)-pyrrolidin-1-yl]-1-cyclohexyl-2-oxo-ethyl-ammonium;
SMILES [NH3+]C(C1CCCCC1)C(=O)N1CCC[C@H]1C(=O)NCc1ccc(cc1)C(O)=O
InChI Key InChIKey=SMKBJOXTGWQOIX-ZENAZSQFSA-O
Data  1 IC50
  Tab Delimited (TSV)   2D SDfile   Computed 3D by Vconf -m prep SDfile
Find this compound or compounds like it in BindingDB:
Activity Spreadsheet -- Enzyme Inhibition Constant Data from BindingDB
Found 1 hit for monomerid = 50153414
TargetDipeptidyl peptidase 4(Homo sapiens (Human))
Merck
Curated by ChEMBL
LigandPNGBDBM50153414(CHEMBL187699 | Trifluoro-acetate2-[(S)-2-(4-carbox...)
Affinity DataIC50:  4.20E+3nM. Assay description: Inhibition of human recombinant Dipeptidylpeptidase IV
In DepthDetails ArticlePubMed