BDBM50154523 CHEMBL3775414
SMILES C1CC(CCO1)[C@H]1N[C@H](Cc2c1[nH]c1ccccc21)c1nc(c[nH]1)-c1ccc(cc1)-c1ccccc1
InChI Key InChIKey=XYETXVHXUVDSNG-XRKRLSELSA-N
Data  2 IC50  1 EC50
  Tab Delimited (TSV)   2D SDfile   Computed 3D by Vconf -m prep SDfile
Find this compound or compounds like it in BindingDB:
Activity Spreadsheet -- Enzyme Inhibition Constant Data from BindingDB
Found 3 hits for monomerid = 50154523
TargetPotassium voltage-gated channel subfamily H member 2(Homo sapiens (Human))
Merck Research Laboratories
Curated by ChEMBL
LigandPNGBDBM50154523(CHEMBL3775414)
Affinity DataIC50:  17nM. Assay description: Binding affinity to human ERG
In DepthDetails ArticlePubMed
TargetSomatostatin receptor type 3(Homo sapiens (Human))
Merck Research Laboratories
Curated by ChEMBL
LigandPNGBDBM50154523(CHEMBL3775414)
Affinity DataIC50:  391nM. Assay description: Binding affinity to human somatostatin receptor type 3
In DepthDetails ArticlePubMed
TargetSomatostatin receptor type 3(Homo sapiens (Human))
Merck Research Laboratories
Curated by ChEMBL
LigandPNGBDBM50154523(CHEMBL3775414)
Affinity DataEC50: >1.00E+3nM. Assay description: Antagonist activity at human somatostatin receptor type 3 assessed as inhibition of cAMP levels
In DepthDetails ArticlePubMed