BDBM50154524 CHEMBL3775456
SMILES FC(F)(F)Oc1cccc(c1)-c1c[nH]c(n1)[C@H]1Cc2c([nH]c3ccccc23)[C@H](N1)C1CCOCC1
InChI Key InChIKey=PORAWELIIZSLJF-FYYLOGMGSA-N
Data  2 IC50  1 EC50
  Tab Delimited (TSV)   2D SDfile   Computed 3D by Vconf -m prep SDfile
Find this compound or compounds like it in BindingDB:
Activity Spreadsheet -- Enzyme Inhibition Constant Data from BindingDB
Found 3 hits for monomerid = 50154524
TargetPotassium voltage-gated channel subfamily H member 2(Homo sapiens (Human))
Merck Research Laboratories
Curated by ChEMBL
LigandPNGBDBM50154524(CHEMBL3775456)
Affinity DataIC50:  58nM. Assay description: Binding affinity to human ERG
In DepthDetails ArticlePubMed
TargetSomatostatin receptor type 3(Homo sapiens (Human))
Merck Research Laboratories
Curated by ChEMBL
LigandPNGBDBM50154524(CHEMBL3775456)
Affinity DataIC50:  43nM. Assay description: Binding affinity to human somatostatin receptor type 3
In DepthDetails ArticlePubMed
TargetSomatostatin receptor type 3(Homo sapiens (Human))
Merck Research Laboratories
Curated by ChEMBL
LigandPNGBDBM50154524(CHEMBL3775456)
Affinity DataEC50: >1.00E+3nM. Assay description: Antagonist activity at human somatostatin receptor type 3 assessed as inhibition of cAMP levels
In DepthDetails ArticlePubMed