BDBM50154538 CHEMBL3775160
SMILES COc1cccc(n1)-c1c[nH]c(n1)[C@H]1Cc2c([nH]c3ccccc23)[C@@](N1)(c1cnn(C)c1)c1noc(C)n1
InChI Key InChIKey=MBFARSZGJXRMQQ-ZBLYBZFDSA-N
Data  1 IC50  1 EC50
  Tab Delimited (TSV)   2D SDfile   Computed 3D by Vconf -m prep SDfile
Find this compound or compounds like it in BindingDB:
Activity Spreadsheet -- Enzyme Inhibition Constant Data from BindingDB
Found 2 hits for monomerid = 50154538
TargetSomatostatin receptor type 3(Homo sapiens (Human))
Merck Research Laboratories
Curated by ChEMBL
LigandPNGBDBM50154538(CHEMBL3775160)
Affinity DataIC50:  2.90nM. Assay description: Binding affinity to human somatostatin receptor type 3
In DepthDetails ArticlePubMed
TargetSomatostatin receptor type 3(Homo sapiens (Human))
Merck Research Laboratories
Curated by ChEMBL
LigandPNGBDBM50154538(CHEMBL3775160)
Affinity DataEC50:  17nM. Assay description: Antagonist activity at human somatostatin receptor type 3 assessed as inhibition of cAMP levels
In DepthDetails ArticlePubMed