BDBM50154547 CHEMBL3775120
SMILES Cn1c2[C@H](N[C@H](Cc2c2ccccc12)c1nc(c[nH]1)-c1ccc(F)cc1)C1CCOCC1
InChI Key InChIKey=FZQDRCUKAVTBJY-ZJSXRUAMSA-N
Data  1 IC50  1 EC50
  Tab Delimited (TSV)   2D SDfile   Computed 3D by Vconf -m prep SDfile
Find this compound or compounds like it in BindingDB:
Activity Spreadsheet -- Enzyme Inhibition Constant Data from BindingDB
Found 2 hits for monomerid = 50154547
TargetSomatostatin receptor type 3(Homo sapiens (Human))
Merck Research Laboratories
Curated by ChEMBL
LigandPNGBDBM50154547(CHEMBL3775120)
Affinity DataIC50:  26nM. Assay description: Binding affinity to human somatostatin receptor type 3
In DepthDetails ArticlePubMed
TargetSomatostatin receptor type 3(Homo sapiens (Human))
Merck Research Laboratories
Curated by ChEMBL
LigandPNGBDBM50154547(CHEMBL3775120)
Affinity DataEC50:  150nM. Assay description: Antagonist activity at human somatostatin receptor type 3 assessed as inhibition of cAMP levels
In DepthDetails ArticlePubMed