BDBM50155006 3-{3-Fluoro-5-[5-(1H-imidazol-2-yl)-tetrazol-2-yl]-phenyl}-4-methyl-pyridine::CHEMBL186703
SMILES Cc1ccncc1-c1cc(F)cc(c1)-n1nnc(n1)-c1ncc[nH]1
InChI Key InChIKey=CZOBXSJMLFQPBT-UHFFFAOYSA-N
Data  1 KI
  Tab Delimited (TSV)   2D SDfile   Computed 3D by Vconf -m prep SDfile
Find this compound or compounds like it in BindingDB:
Activity Spreadsheet -- Enzyme Inhibition Constant Data from BindingDB
Found 1 hit for monomerid = 50155006
TargetMetabotropic glutamate receptor 5(Rattus norvegicus (Rat))
Merck Research Laboratories
Curated by ChEMBL
LigandPNGBDBM50155006(3-{3-Fluoro-5-[5-(1H-imidazol-2-yl)-tetrazol-2-yl]...)
Affinity DataKi:  3.5nM. Assay description: Binding affinity towards Metabotropic glutamate receptor was determined by displacing [3H]-3-methoxy-5-(pyridin-2-ylethynyl)pyridine from rat cortica...
In DepthDetails ArticlePubMed