BDBM50155062 CHEMBL364649::N-Ethyl-4-[(8-furan-3-ylmethyl-8-aza-bicyclo[3.2.1]oct-3-ylidene)-pyridin-2-yl-methyl]-benzamide
SMILES [#6]-[#6]-[#7]-[#6](=O)-c1ccc(cc1)-[#6](=[#6]-1/[#6]-[#6]-2-[#6]-[#6]-[#6](-[#6]-1)-[#7]-2-[#6]-c1ccoc1)\c1ccccn1
InChI Key InChIKey=GOGHNXCDTHQGMK-UHFFFAOYSA-N
Data  1 KI
  Tab Delimited (TSV)   2D SDfile   Computed 3D by Vconf -m prep SDfile
Find this compound or compounds like it in BindingDB:
Activity Spreadsheet -- Enzyme Inhibition Constant Data from BindingDB
Found 1 hit for monomerid = 50155062
TargetMu-type opioid receptor(MOUSE)
Johnson And Johnson Pharmaceutical Research And Development
Curated by ChEMBL
LigandPNGBDBM50155062(CHEMBL364649 | N-Ethyl-4-[(8-furan-3-ylmethyl-8-az...)
Affinity DataKi:  45nM. Assay description: Binding affinity against mu opioid receptor in mouse hot plate test
In DepthDetails ArticlePubMed