BDBM50155065 4-{Bromo-[(1R,5S)-8-furan-3-ylmethyl-8-aza-bicyclo[3.2.1]oct-(3Z)-ylidene]-methyl}-N-ethyl-benzamide::CHEMBL185983
SMILES CCNC(=O)c1ccc(cc1)C(\Br)=C1/C[C@@H]2CC[C@H](C1)N2Cc1ccoc1
InChI Key InChIKey=ZBZQAORTBQOLGF-YZSJRQJUSA-N
Data  1 KI
  Tab Delimited (TSV)   2D SDfile   Computed 3D by Vconf -m prep SDfile
Find this compound or compounds like it in BindingDB:
Activity Spreadsheet -- Enzyme Inhibition Constant Data from BindingDB
Found 1 hit for monomerid = 50155065
TargetMu-type opioid receptor(MOUSE)
Johnson And Johnson Pharmaceutical Research And Development
Curated by ChEMBL
LigandPNGBDBM50155065(4-{Bromo-[(1R,5S)-8-furan-3-ylmethyl-8-aza-bicyclo...)
Affinity DataKi:  39nM. Assay description: Binding affinity against mu opioid receptor in mouse hot plate test
In DepthDetails ArticlePubMed