BDBM50155084 CHEMBL434903::N-Ethyl-4-[(8-furan-3-ylmethyl-8-aza-bicyclo[3.2.1]oct-3-ylidene)-(1-methoxy-1,4-dihydro-pyridin-3-yl)-methyl]-benzamide
SMILES [#6]-[#6]-[#7]-[#6](=O)-c1ccc(cc1)-[#6](=[#6]-1/[#6]-[#6]-2-[#6]-[#6]-[#6](-[#6]-1)-[#7]-2-[#6]-c1ccoc1)\[#6]-1=[#6]-[#7](-[#8]-[#6])-[#6]=[#6]-[#6]1
InChI Key InChIKey=VLJJAFQROOXFMM-UHFFFAOYSA-N
Data  1 KI
  Tab Delimited (TSV)   2D SDfile   Computed 3D by Vconf -m prep SDfile
Find this compound or compounds like it in BindingDB:
Activity Spreadsheet -- Enzyme Inhibition Constant Data from BindingDB
Found 1 hit for monomerid = 50155084
TargetMu-type opioid receptor(MOUSE)
Johnson And Johnson Pharmaceutical Research And Development
Curated by ChEMBL
LigandPNGBDBM50155084(CHEMBL434903 | N-Ethyl-4-[(8-furan-3-ylmethyl-8-az...)
Affinity DataKi:  1.90nM. Assay description: Binding affinity against mu opioid receptor in mouse hot plate test
In DepthDetails ArticlePubMed