BDBM50155087 3-{(4-Ethylcarbamoyl-phenyl)-[(1S,5R)-8-(3-methyl-but-3-enyl)-8-aza-bicyclo[3.2.1]oct-(3Z)-ylidene]-methyl}-benzoic acid::CHEMBL184090
SMILES CCNC(=O)c1ccc(cc1)C(=C1/C[C@@H]2CC[C@H](C1)N2CCC(C)=C)\c1cccc(c1)C(O)=O
InChI Key InChIKey=BMIKEGHEXVZGMA-HCUXQVBUSA-N
Data  1 KI
  Tab Delimited (TSV)   2D SDfile   Computed 3D by Vconf -m prep SDfile
Find this compound or compounds like it in BindingDB:
Activity Spreadsheet -- Enzyme Inhibition Constant Data from BindingDB
Found 1 hit for monomerid = 50155087
TargetMu-type opioid receptor(MOUSE)
Johnson And Johnson Pharmaceutical Research And Development
Curated by ChEMBL
LigandPNGBDBM50155087(3-{(4-Ethylcarbamoyl-phenyl)-[(1S,5R)-8-(3-methyl-...)
Affinity DataKi:  24nM. Assay description: Binding affinity against mu opioid receptor in mouse hot plate test
In DepthDetails ArticlePubMed