BDBM50155117 CHEMBL361483::N-Ethyl-4-{[3-(1H-tetrazol-5-yl)-phenyl]-[(1S,5R)-8-thiophen-3-ylmethyl-8-aza-bicyclo[3.2.1]oct-(3E)-ylidene]-methyl}-benzamide
SMILES CCNC(=O)c1ccc(cc1)C(=C1\C[C@@H]2CC[C@H](C1)N2Cc1ccsc1)\c1cccc(c1)-c1nnn[nH]1
InChI Key InChIKey=BOMHAWWRYBAPPZ-XDGQVVELSA-N
Data  1 KI
  Tab Delimited (TSV)   2D SDfile   Computed 3D by Vconf -m prep SDfile
Find this compound or compounds like it in BindingDB:
Activity Spreadsheet -- Enzyme Inhibition Constant Data from BindingDB
Found 1 hit for monomerid = 50155117
TargetMu-type opioid receptor(MOUSE)
Johnson And Johnson Pharmaceutical Research And Development
Curated by ChEMBL
LigandPNGBDBM50155117(CHEMBL361483 | N-Ethyl-4-{[3-(1H-tetrazol-5-yl)-ph...)
Affinity DataKi:  12nM. Assay description: Binding affinity against mu opioid receptor in mouse hot plate test
In DepthDetails ArticlePubMed