BDBM50155726 1-(2,2-Diphenyl-ethyl)-6,7-dimethoxy-3,4-dihydro-1H-isoquinoline-2-carboxylic acid methyl ester::CHEMBL433573
SMILES COC(=O)N1CCc2cc(OC)c(OC)cc2C1CC(c1ccccc1)c1ccccc1
InChI Key InChIKey=LHCOFWFBZKDXFR-UHFFFAOYSA-N
Data  2 IC50
  Tab Delimited (TSV)   2D SDfile   Computed 3D by Vconf -m prep SDfile
Find this compound or compounds like it in BindingDB:
Activity Spreadsheet -- Enzyme Inhibition Constant Data from BindingDB
Found 2 hits for monomerid = 50155726
TargetMelatonin receptor type 1B(Homo sapiens (Human))
Bristol-Myers Squibb Pharmaceutical Research Institute
Curated by ChEMBL
LigandPNGBDBM50155726(1-(2,2-Diphenyl-ethyl)-6,7-dimethoxy-3,4-dihydro-1...)
Affinity DataIC50:  22nM. Assay description: Inhibitory concentration against Melatonin receptor type 1B
In DepthDetails ArticlePubMed
TargetMelatonin receptor type 1A(Homo sapiens (Human))
Bristol-Myers Squibb Pharmaceutical Research Institute
Curated by ChEMBL
LigandPNGBDBM50155726(1-(2,2-Diphenyl-ethyl)-6,7-dimethoxy-3,4-dihydro-1...)
Affinity DataIC50:  673nM. Assay description: Inhibitory concentration against Melatonin receptor type 1A
In DepthDetails ArticlePubMed