BDBM50155787 3-Butyl-[1,4]thiazepan-(5E)-ylideneamine::CHEMBL186091
SMILES CCCCC1CSCCC(N)=N1
InChI Key InChIKey=FGUKFZPUKNZRSR-UHFFFAOYSA-N
Data  3 IC50
  Tab Delimited (TSV)   2D SDfile   Computed 3D by Vconf -m prep SDfile
Find this compound or compounds like it in BindingDB:
Activity Spreadsheet -- Enzyme Inhibition Constant Data from BindingDB
Found 3 hits for monomerid = 50155787
TargetNitric oxide synthase, inducible(Homo sapiens (Human))
Merck Research Laboratories
Curated by ChEMBL
LigandPNGBDBM50155787(3-Butyl-[1,4]thiazepan-(5E)-ylideneamine | CHEMBL1...)
Affinity DataIC50:  500nM. Assay description: Inhibitory concentration against Inducible nitric oxide synthase
In DepthDetails ArticlePubMed
TargetNitric oxide synthase, brain(Homo sapiens (Human))
Merck Research Laboratories
Curated by ChEMBL
LigandPNGBDBM50155787(3-Butyl-[1,4]thiazepan-(5E)-ylideneamine | CHEMBL1...)
Affinity DataIC50:  1.20E+3nM. Assay description: Inhibitory concentration against Neuronal nitric oxide synthase
In DepthDetails ArticlePubMed
TargetNitric oxide synthase, endothelial(Homo sapiens (Human))
Merck Research Laboratories
Curated by ChEMBL
LigandPNGBDBM50155787(3-Butyl-[1,4]thiazepan-(5E)-ylideneamine | CHEMBL1...)
Affinity DataIC50:  7.70E+4nM. Assay description: Inhibitory concentration against Endothelial nitric oxide synthase
In DepthDetails ArticlePubMed