BDBM50155791 6-Methyl-[1,4]thiazepan-(5E)-ylideneamine::CHEMBL188073
SMILES CC1CSCCN=C1N
InChI Key InChIKey=QJWUYRKXIRMOHR-UHFFFAOYSA-N
Data  3 IC50
  Tab Delimited (TSV)   2D SDfile   Computed 3D by Vconf -m prep SDfile
Find this compound or compounds like it in BindingDB:
Activity Spreadsheet -- Enzyme Inhibition Constant Data from BindingDB
Found 3 hits for monomerid = 50155791
TargetNitric oxide synthase, brain(Homo sapiens (Human))
Merck Research Laboratories
Curated by ChEMBL
LigandPNGBDBM50155791(6-Methyl-[1,4]thiazepan-(5E)-ylideneamine | CHEMBL...)
Affinity DataIC50: >5.00E+4nM. Assay description: Inhibitory concentration against Neuronal nitric oxide synthase
In DepthDetails ArticlePubMed
TargetNitric oxide synthase, inducible(Homo sapiens (Human))
Merck Research Laboratories
Curated by ChEMBL
LigandPNGBDBM50155791(6-Methyl-[1,4]thiazepan-(5E)-ylideneamine | CHEMBL...)
Affinity DataIC50: >5.00E+4nM. Assay description: Inhibitory concentration against Inducible nitric oxide synthase
In DepthDetails ArticlePubMed
TargetNitric oxide synthase, endothelial(Homo sapiens (Human))
Merck Research Laboratories
Curated by ChEMBL
LigandPNGBDBM50155791(6-Methyl-[1,4]thiazepan-(5E)-ylideneamine | CHEMBL...)
Affinity DataIC50: >5.00E+4nM. Assay description: Inhibitory concentration against Endothelial nitric oxide synthase
In DepthDetails ArticlePubMed