BDBM50155834 4-Phenyl-1-[5-(pyrrolidine-1-carbonyl)-cyclopent-1-enyl]-butan-1-one::CHEMBL186979
SMILES O=C(CCCc1ccccc1)C1=CCCC1C(=O)N1CCCC1
InChI Key InChIKey=JFQQNRVTXZTKKE-UHFFFAOYSA-N
Data  1 IC50
  Tab Delimited (TSV)   2D SDfile   Computed 3D by Vconf -m prep SDfile
Find this compound or compounds like it in BindingDB:
Activity Spreadsheet -- Enzyme Inhibition Constant Data from BindingDB
Found 1 hit for monomerid = 50155834
TargetProlyl endopeptidase(Sus scrofa)
University Of Kuopio
Curated by ChEMBL
LigandPNGBDBM50155834(4-Phenyl-1-[5-(pyrrolidine-1-carbonyl)-cyclopent-1...)
Affinity DataIC50:  1.30nM. Assay description: Inhibitory activity against prolyl oligopeptidase of porcine brain homogenate
In DepthDetails ArticlePubMed