BDBM50156066 CHEMBL360813::N-(2,5-Diphenyl-2H-pyrazol-3-yl)-3-methyl-benzamide
SMILES Cc1cccc(c1)C(=O)Nc1cc(nn1-c1ccccc1)-c1ccccc1
InChI Key InChIKey=ZHJHRQRNTYRLFA-UHFFFAOYSA-N
Data  2 EC50
  Tab Delimited (TSV)   2D SDfile   Computed 3D by Vconf -m prep SDfile
Find this compound or compounds like it in BindingDB:
Activity Spreadsheet -- Enzyme Inhibition Constant Data from BindingDB
Found 2 hits for monomerid = 50156066
TargetMetabotropic glutamate receptor 5(Homo sapiens (Human))
Merck Research Laboratories
Curated by ChEMBL
LigandPNGBDBM50156066(CHEMBL360813 | N-(2,5-Diphenyl-2H-pyrazol-3-yl)-3-...)
Affinity DataEC50:  90nM. Assay description: Effective concentration against metabotropic glutamate receptor 5 of human transfected into CHO cells
In DepthDetails ArticlePubMed
TargetMetabotropic glutamate receptor 5(Rattus norvegicus (Rat))
Merck Research Laboratories
Curated by ChEMBL
LigandPNGBDBM50156066(CHEMBL360813 | N-(2,5-Diphenyl-2H-pyrazol-3-yl)-3-...)
Affinity DataEC50:  100nM. Assay description: Effective concentration against metabotropic glutamate receptor 5 of rat
In DepthDetails ArticlePubMed