BDBM50156198 CHEMBL3781801
SMILES COc1ccc2cccc(CCNS(=O)(=O)c3ccc(OC)c(c3)N3CCNCC3)c2c1
InChI Key InChIKey=ZYXRUBLOBOXBJP-UHFFFAOYSA-N
Data  1 IC50
  Tab Delimited (TSV)   2D SDfile   Computed 3D by Vconf -m prep SDfile
Find this compound or compounds like it in BindingDB:
Activity Spreadsheet -- Enzyme Inhibition Constant Data from BindingDB
Found 1 hit for monomerid = 50156198
Target5-hydroxytryptamine receptor 6(Homo sapiens (Human))
Temple University
Curated by ChEMBL
LigandPNGBDBM50156198(CHEMBL3781801)
Affinity DataIC50:  1nM. Assay description: Displacement of [3H]LSD from human 5-HT6 receptor expressed in CHO cell membranes after 120 mins by liquid scintillation counting method
In DepthDetails ArticlePubMed