BDBM50156208 CHEMBL3780861
SMILES COc1ccc(cc1N1CCNCC1)S(=O)(=O)NCC(C)(C)c1cccc2ccc(Br)cc12
InChI Key InChIKey=HSEURCVTQKHGMM-UHFFFAOYSA-N
Data  1 IC50
  Tab Delimited (TSV)   2D SDfile   Computed 3D by Vconf -m prep SDfile
Find this compound or compounds like it in BindingDB:
Activity Spreadsheet -- Enzyme Inhibition Constant Data from BindingDB
Found 1 hit for monomerid = 50156208
Target5-hydroxytryptamine receptor 6(Homo sapiens (Human))
Temple University
Curated by ChEMBL
LigandPNGBDBM50156208(CHEMBL3780861)
Affinity DataIC50:  1.70nM. Assay description: Displacement of [3H]LSD from human 5-HT6 receptor expressed in CHO cell membranes after 120 mins by liquid scintillation counting method
In DepthDetails ArticlePubMed