BDBM50156220 CHEMBL3782049
SMILES COc1ccc2cccc(c2c1)C1(CNS(=O)(=O)c2ccc(OC)c(c2)N2CCN(C)CC2)CC1
InChI Key InChIKey=CYZZLNHRWWUMSM-UHFFFAOYSA-N
Data  1 IC50
  Tab Delimited (TSV)   2D SDfile   Computed 3D by Vconf -m prep SDfile
Find this compound or compounds like it in BindingDB:
Activity Spreadsheet -- Enzyme Inhibition Constant Data from BindingDB
Found 1 hit for monomerid = 50156220
Target5-hydroxytryptamine receptor 6(Homo sapiens (Human))
Temple University
Curated by ChEMBL
LigandPNGBDBM50156220(CHEMBL3782049)
Affinity DataIC50:  2.10nM. Assay description: Displacement of [3H]LSD from human 5-HT6 receptor expressed in CHO cell membranes after 120 mins by liquid scintillation counting method
In DepthDetails ArticlePubMed