BDBM50156223 CHEMBL3780530
SMILES COc1ccc(cc1N1CCNCC1)S(=O)(=O)NCCc1ccc(OC)c2ccccc12
InChI Key InChIKey=XJWCFASYQQOQAH-UHFFFAOYSA-N
Data  1 IC50
  Tab Delimited (TSV)   2D SDfile   Computed 3D by Vconf -m prep SDfile
Find this compound or compounds like it in BindingDB:
Activity Spreadsheet -- Enzyme Inhibition Constant Data from BindingDB
Found 1 hit for monomerid = 50156223
Target5-hydroxytryptamine receptor 6(Homo sapiens (Human))
Temple University
Curated by ChEMBL
LigandPNGBDBM50156223(CHEMBL3780530)
Affinity DataIC50:  5.5nM. Assay description: Displacement of [3H]LSD from human 5-HT6 receptor expressed in CHO cell membranes after 120 mins by liquid scintillation counting method
In DepthDetails ArticlePubMed