BDBM50156224 CHEMBL3780950
SMILES COc1ccc(cc1N1CCN(C)CC1)S(=O)(=O)NCCc1ccc(OC)c2ccccc12
InChI Key InChIKey=FIOCMWWBXGQEOI-UHFFFAOYSA-N
Data  1 IC50
  Tab Delimited (TSV)   2D SDfile   Computed 3D by Vconf -m prep SDfile
Find this compound or compounds like it in BindingDB:
Activity Spreadsheet -- Enzyme Inhibition Constant Data from BindingDB
Found 1 hit for monomerid = 50156224
Target5-hydroxytryptamine receptor 6(Homo sapiens (Human))
Temple University
Curated by ChEMBL
LigandPNGBDBM50156224(CHEMBL3780950)
Affinity DataIC50:  2.60nM. Assay description: Displacement of [3H]LSD from human 5-HT6 receptor expressed in CHO cell membranes after 120 mins by liquid scintillation counting method
In DepthDetails ArticlePubMed