BDBM50156555 2-(4-((R)-2-((S,E)-3-hydroxy-4-(3-(trifluoromethyl)phenyl)but-1-enyl)-5-oxopyrrolidin-1-yl)butoxy)acetic acid::CHEMBL373558
SMILES O[C@@H](Cc1cccc(c1)C(F)(F)F)\C=C\[C@H]1CCC(=O)N1CCCCOCC(O)=O
InChI Key InChIKey=MVSJYHSXLYISPF-JFDVKVQISA-N
Data  1 KI  1 EC50
  Tab Delimited (TSV)   2D SDfile   Computed 3D by Vconf -m prep SDfile
Find this compound or compounds like it in BindingDB:
Activity Spreadsheet -- Enzyme Inhibition Constant Data from BindingDB
Found 2 hits for monomerid = 50156555
TargetProstaglandin E2 receptor EP4 subtype(Homo sapiens (Human))
Roche Palo Alto
Curated by ChEMBL
LigandPNGBDBM50156555(2-(4-((R)-2-((S,E)-3-hydroxy-4-(3-(trifluoromethyl...)
Affinity DataKi:  7nM. Assay description: Binding affinity to human EP4 receptor
In DepthDetails ArticlePubMed
TargetProstaglandin E2 receptor EP4 subtype(Homo sapiens (Human))
Roche Palo Alto
Curated by ChEMBL
LigandPNGBDBM50156555(2-(4-((R)-2-((S,E)-3-hydroxy-4-(3-(trifluoromethyl...)
Affinity DataEC50:  180nM. Assay description: Functional activity at human EP4 receptor
In DepthDetails ArticlePubMed