BDBM50156624 5-((7S,9aS)-7-((bis(pyridin-3-ylmethyl)amino)methyl)-hexahydro-1H-pyrido[1,2-a]pyrazin-2(6H)-yl)-2-(furan-2-yl)-[1,2,4]triazolo[1,5-a][1,3,5]triazin-7-amine::CHEMBL222478
SMILES Nc1nc(nc2nc(nn12)-c1ccco1)N1CCN2C[C@H](CN(Cc3cccnc3)Cc3cccnc3)CC[C@H]2C1
InChI Key InChIKey=HNYJIMBAFFAEPW-ZEQRLZLVSA-N
Data  2 KI
  Tab Delimited (TSV)   2D SDfile   Computed 3D by Vconf -m prep SDfile
Find this compound or compounds like it in BindingDB:
Activity Spreadsheet -- Enzyme Inhibition Constant Data from BindingDB
Found 2 hits for monomerid = 50156624
TargetAdenosine receptor A2a(Rattus norvegicus (rat))
Biogen Idec
Curated by ChEMBL
LigandPNGBDBM50156624(5-((7S,9aS)-7-((bis(pyridin-3-ylmethyl)amino)methy...)
Affinity DataKi:  4nM. Assay description: Displacement of [3H]ZM241385 from adenosine A2A receptor in rat brain membrane
In DepthDetails ArticlePubMed
TargetAdenosine receptor A1(Rattus norvegicus (rat))
Biogen Idec
Curated by ChEMBL
LigandPNGBDBM50156624(5-((7S,9aS)-7-((bis(pyridin-3-ylmethyl)amino)methy...)
Affinity DataKi:  7.80E+3nM. Assay description: Displacement of [3h]DPCPX from adenosine A receptor in rat cerebral cortex membrane
In DepthDetails ArticlePubMed