BDBM50157425 1-(4-{4-[4-(2,3-Dihydro-benzo[1,4]dioxin-6-ylsulfanyl)-3-trifluoromethyl-phenyl]-pyridin-2-yl}-piperazin-1-yl)-ethanone::CHEMBL182384
SMILES CC(=O)N1CCN(CC1)c1cc(ccn1)-c1ccc(Sc2ccc3OCCOc3c2)c(c1)C(F)(F)F
InChI Key InChIKey=BVXBVMYTIQBMPV-UHFFFAOYSA-N
Data  1 IC50
  Tab Delimited (TSV)   2D SDfile   Computed 3D by Vconf -m prep SDfile
Find this compound or compounds like it in BindingDB:
Activity Spreadsheet -- Enzyme Inhibition Constant Data from BindingDB
Found 1 hit for monomerid = 50157425
TargetIntegrin alpha-L/Intercellular adhesion molecule 1(Homo sapiens (Human))
Abbott Laboratories
Curated by ChEMBL
LigandPNGBDBM50157425(1-(4-{4-[4-(2,3-Dihydro-benzo[1,4]dioxin-6-ylsulfa...)
Affinity DataIC50:  131nM. Assay description: Inhibitory concentration against integrin LFA-1/ICAM-1 binding complex
In DepthDetails ArticlePubMed