BDBM50159658 8-Methoxy-2-morpholin-4-yl-chromen-4-one::8-methoxy-2-morpholino-4H-chromen-4-one::CHEMBL97024
SMILES COc1cccc2c1oc(cc2=O)N1CCOCC1
InChI Key InChIKey=USIRKXHEGVTPLO-UHFFFAOYSA-N
Data  2 IC50
  Tab Delimited (TSV)   2D SDfile   Computed 3D by Vconf -m prep SDfile
Find this compound or compounds like it in BindingDB:
Activity Spreadsheet -- Enzyme Inhibition Constant Data from BindingDB
Found 2 hits for monomerid = 50159658
TargetDNA-dependent protein kinase catalytic subunit(Homo sapiens (Human))
Newcastle University
Curated by ChEMBL
LigandPNGBDBM50159658(8-Methoxy-2-morpholin-4-yl-chromen-4-one | 8-metho...)
Affinity DataIC50:  1.80E+3nM. Assay description: Inhibition of DNA-dependent protein kinase
In DepthDetails ArticlePubMed
TargetDNA-dependent protein kinase catalytic subunit(Homo sapiens (Human))
Newcastle University
Curated by ChEMBL
LigandPNGBDBM50159658(8-Methoxy-2-morpholin-4-yl-chromen-4-one | 8-metho...)
Affinity DataIC50:  1.20E+3nM. Assay description: Inhibition of DNA dependent protein kinase isolated from HeLa cells
In DepthDetails ArticlePubMed