BDBM50159706 CHEMBL3787609
SMILES CC(C)(C)OC(=O)N[C@@H](CCCCNC(=O)[C@@H]1Cc2ccccc2CN1C(=O)CCc1ccccc1)C(=O)NCC(c1ccccc1)c1ccccc1
InChI Key InChIKey=LWYKXCKHNLEQOC-YDAXCOIMSA-N
Data  3 EC50
  Tab Delimited (TSV)   2D SDfile   Computed 3D by Vconf -m prep SDfile
Find this compound or compounds like it in BindingDB:
Activity Spreadsheet -- Enzyme Inhibition Constant Data from BindingDB
Found 3 hits for monomerid = 50159706
TargetC-X-C chemokine receptor type 3(Homo sapiens (Human))
Friedrich-Alexander University
Curated by ChEMBL
LigandPNGBDBM50159706(CHEMBL3787609)
Affinity DataEC50:  62nM. Assay description: Positive allosteric modulation of ProLink1-tagged wild type CXCR3 (unknown origin) expressed in HEK293T cells assessed as beta-arrestin-2 recruitment...
In DepthDetails ArticlePubMed
TargetC-X-C chemokine receptor type 3(Homo sapiens (Human))
Friedrich-Alexander University
Curated by ChEMBL
LigandPNGBDBM50159706(CHEMBL3787609)
Affinity DataEC50:  195nM. Assay description: Positive allosteric modulation of ProLink2-tagged wild type CXCR3 (unknown origin) expressed in HEK293T cells assessed as beta-arrestin-2 recruitment...
In DepthDetails ArticlePubMed
TargetC-X-C chemokine receptor type 3(Homo sapiens (Human))
Friedrich-Alexander University
Curated by ChEMBL
LigandPNGBDBM50159706(CHEMBL3787609)
Affinity DataEC50:  61.7nM. Assay description: Positive allosteric modulation of ProLink1-tagged wild type CXCR3 (unknown origin) expressed in HEK293T cells assessed as beta-arrestin-2 recruitment...
In DepthDetails ArticlePubMed