BDBM50160033 CHEMBL183795::N-(4-Isopropyl-phenyl)-4-pyridin-2-yl-benzamide
SMILES CC(C)c1ccc(NC(=O)c2ccc(cc2)-c2ccccn2)cc1
InChI Key InChIKey=CUQSOVLYZUKUKI-UHFFFAOYSA-N
Data  1 IC50
  Tab Delimited (TSV)   2D SDfile   Computed 3D by Vconf -m prep SDfile
Find this compound or compounds like it in BindingDB:
Activity Spreadsheet -- Enzyme Inhibition Constant Data from BindingDB
Found 1 hit for monomerid = 50160033
TargetTransient receptor potential cation channel subfamily V member 1(Rattus norvegicus (rat))
Seoul National University
Curated by ChEMBL
LigandPNGBDBM50160033(CHEMBL183795 | N-(4-Isopropyl-phenyl)-4-pyridin-2-...)
Affinity DataIC50:  38nM. Assay description: In vitro antagonistic activity on VR1 receptor in [Ca2+] influx assay in rat dorsal root ganglion
In DepthDetails ArticlePubMed