BDBM50160036 CHEMBL183121::N-(4-tert-Butyl-phenyl)-4-pyridin-2-yl-benzamide::N-(4-tert-butylphenyl)-4-(pyridin-2-yl)benzamide
SMILES CC(C)(C)c1ccc(NC(=O)c2ccc(cc2)-c2ccccn2)cc1
InChI Key InChIKey=JWPYMHAYISNKIC-UHFFFAOYSA-N
Data  4 IC50
  Tab Delimited (TSV)   2D SDfile   Computed 3D by Vconf -m prep SDfile
Find this compound or compounds like it in BindingDB:
Activity Spreadsheet -- Enzyme Inhibition Constant Data from BindingDB
Found 4 hits for monomerid = 50160036
TargetTransient receptor potential cation channel subfamily V member 1(Homo sapiens (Human))
Neurogen
Curated by ChEMBL
LigandPNGBDBM50160036(CHEMBL183121 | N-(4-tert-Butyl-phenyl)-4-pyridin-2...)
Affinity DataIC50:  11nM. Assay description: Antagonist activity against capsaicin-activated human VR1 by FLIPR assay
In DepthDetails ArticlePubMed
TargetTransient receptor potential cation channel subfamily V member 1(Rattus norvegicus (rat))
Neurogen
Curated by ChEMBL
LigandPNGBDBM50160036(CHEMBL183121 | N-(4-tert-Butyl-phenyl)-4-pyridin-2...)
Affinity DataIC50:  8nM. Assay description: Antagonist activity against low pH(5.0-5.5)-activated rat VR1
In DepthDetails ArticlePubMed
TargetTransient receptor potential cation channel subfamily V member 1(Rattus norvegicus (rat))
Neurogen
Curated by ChEMBL
LigandPNGBDBM50160036(CHEMBL183121 | N-(4-tert-Butyl-phenyl)-4-pyridin-2...)
Affinity DataIC50:  31nM. Assay description: In vitro antagonistic activity on VR1 receptor in [Ca2+] influx assay in rat dorsal root ganglion
In DepthDetails ArticlePubMed
TargetTransient receptor potential cation channel subfamily V member 1(Homo sapiens (Human))
Neurogen
Curated by ChEMBL
LigandPNGBDBM50160036(CHEMBL183121 | N-(4-tert-Butyl-phenyl)-4-pyridin-2...)
Affinity DataIC50:  42nM. Assay description: Antagonist activity at human recombinant TRPV1 expressed in human 1321N1 cells assessed as inhibition of capsaicin-induced calcium influx by FLIPR as...
In DepthDetails ArticlePubMed