BDBM50160579 CHEMBL3785586
SMILES Brc1ccc(cc1)-c1nnc(Nc2cccc(Br)c2)s1
InChI Key InChIKey=GGLGVWMTKNVKKK-UHFFFAOYSA-N
Data  1 IC50
  Tab Delimited (TSV)   2D SDfile   Computed 3D by Vconf -m prep SDfile
Find this compound or compounds like it in BindingDB:
Activity Spreadsheet -- Enzyme Inhibition Constant Data from BindingDB
Found 1 hit for monomerid = 50160579
TargetBeta-glucuronidase(Bos taurus (Bovine))
University Of Karachi
Curated by ChEMBL
LigandPNGBDBM50160579(CHEMBL3785586)
Affinity DataIC50:  1.73E+4nM. Assay description: Inhibition of bovine beta-glucuronidase assessed as p-nitrophenol formation preincubated for 30 mins followed by addition of p-nitrophenyl-beta-D-glu...
In DepthDetails ArticlePubMed