BDBM50162021 3-((S)-2-Amino-2-phenyl-ethyl)-1-(2,6-difluoro-benzyl)-5-(2-fluoro-3-methoxy-phenyl)-6-methyl-1H-pyrimidine-2,4-dione::CHEMBL540207
SMILES COc1cccc(c1F)-c1c(C)n(Cc2c(F)cccc2F)c(=O)n(C[C@@H](N)c2ccccc2)c1=O
InChI Key InChIKey=CJUWBZDJMYYRDG-JOCHJYFZSA-N
Data  1 KI
  Tab Delimited (TSV)   2D SDfile   Computed 3D by Vconf -m prep SDfile
Find this compound or compounds like it in BindingDB:
Activity Spreadsheet -- Enzyme Inhibition Constant Data from BindingDB
Found 1 hit for monomerid = 50162021
TargetGonadotropin-releasing hormone receptor(Homo sapiens (Human))
Neurocrine Biosciences
Curated by ChEMBL
LigandPNGBDBM50162021(3-((S)-2-Amino-2-phenyl-ethyl)-1-(2,6-difluoro-ben...)
Affinity DataKi:  22nM. Assay description: Binding affinity for Human gonadotropin-releasing hormone receptor
In DepthDetails ArticlePubMed