BDBM50162762 CHEMBL181327::[(S)-4-Guanidino-1-((S)-4-{(S)-5-[4-(5-guanidino-pentanoylamino)-butyl]-3-oxo-6-oxo-piperazin-2-yl}-butylcarbamoyl)-butyl]-carbamic acid benzyl ester
SMILES NC(=N)NCCCCC(=O)NCCCC[C@@H]1NC(=O)[C@H](CCCCNC(=O)[C@H](CCCNC(N)=N)NC(=O)OCc2ccccc2)NC1=O
InChI Key InChIKey=XLFVGGLDVJXBRJ-SDHOMARFSA-N
Data  1 IC50
  Tab Delimited (TSV)   2D SDfile   Computed 3D by Vconf -m prep SDfile
Find this compound or compounds like it in BindingDB:
Activity Spreadsheet -- Enzyme Inhibition Constant Data from BindingDB
Found 1 hit for monomerid = 50162762
TargetTryptase beta-2(Homo sapiens (Human))
University Of Barcelona
Curated by ChEMBL
LigandPNGBDBM50162762(CHEMBL181327 | [(S)-4-Guanidino-1-((S)-4-{(S)-5-[4...)
Affinity DataIC50:  5.70E+3nM. Assay description: Inhibitory concentration against tryptase
In DepthDetails ArticlePubMed