BDBM50162766 CHEMBL181467::N-((S)-4-{(S)-5-[(3-Carbamimidoyl-phenylcarbamoyl)-methyl]-3,6-dioxo-piperazin-2-yl}-butyl)-3-(N-methyl-guanidino)-propionamide
SMILES CN(CCC(=O)NCCCC[C@@H]1NC(=O)[C@H](CC(=O)Nc2cccc(c2)C(N)=N)NC1=O)C(N)=N
InChI Key InChIKey=GOEOXPFKEHMXCH-HOTGVXAUSA-N
Data  1 IC50
  Tab Delimited (TSV)   2D SDfile   Computed 3D by Vconf -m prep SDfile
Find this compound or compounds like it in BindingDB:
Activity Spreadsheet -- Enzyme Inhibition Constant Data from BindingDB
Found 1 hit for monomerid = 50162766
TargetTryptase beta-2(Homo sapiens (Human))
University Of Barcelona
Curated by ChEMBL
LigandPNGBDBM50162766(CHEMBL181467 | N-((S)-4-{(S)-5-[(3-Carbamimidoyl-p...)
Affinity DataIC50:  1.28E+4nM. Assay description: Inhibitory concentration against tryptase
In DepthDetails ArticlePubMed