BDBM50162767 CHEMBL180850::N-((S)-4-{(S)-5-[(3-Carbamimidoyl-phenylcarbamoyl)-methyl]-3,6-dioxo-piperazin-2-yl}-butyl)-3-guanidino-propionamide
SMILES NC(=N)NCCC(=O)NCCCC[C@@H]1NC(=O)[C@H](CC(=O)Nc2cccc(c2)C(N)=N)NC1=O
InChI Key InChIKey=BOWVXWXNKIXJFL-GJZGRUSLSA-N
Data  1 IC50
  Tab Delimited (TSV)   2D SDfile   Computed 3D by Vconf -m prep SDfile
Find this compound or compounds like it in BindingDB:
Activity Spreadsheet -- Enzyme Inhibition Constant Data from BindingDB
Found 1 hit for monomerid = 50162767
TargetTryptase beta-2(Homo sapiens (Human))
University Of Barcelona
Curated by ChEMBL
LigandPNGBDBM50162767(CHEMBL180850 | N-((S)-4-{(S)-5-[(3-Carbamimidoyl-p...)
Affinity DataIC50:  2.36E+4nM. Assay description: Inhibitory concentration against tryptase
In DepthDetails ArticlePubMed