BDBM50162770 CHEMBL180281::N-[4-Guanidino-1-((S)-4-{(S)-5-[4-((S)-4-guanidino-butyrylamino)-butyl]-3-oxo-6-oxo-piperazin-2-yl}-butylcarbamoyl)-butyl]-benzamide
SMILES NC(=N)NCCC[C@H](NC(=O)c1ccccc1)C(=O)NCCCC[C@@H]1NC(=O)[C@H](CCCCNC(=O)CCCNC(N)=N)NC1=O
InChI Key InChIKey=CJOQKLGIDKSJDA-VABKMULXSA-N
Data  1 IC50
  Tab Delimited (TSV)   2D SDfile   Computed 3D by Vconf -m prep SDfile
Find this compound or compounds like it in BindingDB:
Activity Spreadsheet -- Enzyme Inhibition Constant Data from BindingDB
Found 1 hit for monomerid = 50162770
TargetTryptase beta-2(Homo sapiens (Human))
University Of Barcelona
Curated by ChEMBL
LigandPNGBDBM50162770(CHEMBL180281 | N-[4-Guanidino-1-((S)-4-{(S)-5-[4-(...)
Affinity DataIC50:  2.40E+3nM. Assay description: Inhibitory concentration against tryptase
In DepthDetails ArticlePubMed