BDBM50162933 CHEMBL3794374
SMILES Oc1ccc(cc1)-c1cc2cc(Br)ccc2o1
InChI Key InChIKey=RHFCUYVQYMOTMK-UHFFFAOYSA-N
Data  1 IC50
  Tab Delimited (TSV)   2D SDfile   Computed 3D by Vconf -m prep SDfile
Find this compound or compounds like it in BindingDB:
Activity Spreadsheet -- Enzyme Inhibition Constant Data from BindingDB
Found 1 hit for monomerid = 50162933
TargetCholinesterase(Equus caballus (Horse))
University Of Cagliari
Curated by ChEMBL
LigandPNGBDBM50162933(CHEMBL3794374)
Affinity DataIC50: >1.00E+5nM. Assay description: Inhibition of equine BChE using S-butyrylthiocholine chloride as substrate by Ellman's method
In DepthDetails ArticlePubMed