BDBM50163753 CHEMBL1615094
SMILES Cn1nc(cc1N)-c1cccs1
InChI Key InChIKey=NFTITKUYTQZKIZ-UHFFFAOYSA-N
Data  1 Kd
PDB links: 3 PDB IDs match this monomer.
  Tab Delimited (TSV)   2D SDfile   Computed 3D by Vconf -m prep SDfile
Find this compound or compounds like it in BindingDB:
Activity Spreadsheet -- Enzyme Inhibition Constant Data from BindingDB
Found 1 hit for monomerid = 50163753
TargetIntegrase(Human immunodeficiency virus 1)
Shandong University
Curated by ChEMBL
LigandPNGBDBM50163753(CHEMBL1615094)
Affinity DataKd:  2.80E+6nM. Assay description: Binding affinity to HIV integrase