BDBM50164468 2-(2-Ethylaminomethyl-phenylsulfanyl)-5-methyl-phenylamine::CHEMBL192619
SMILES CCNCc1ccccc1Sc1ccc(C)cc1N
InChI Key InChIKey=BXZSHOGOEKAIFQ-UHFFFAOYSA-N
Data  3 KI
  Tab Delimited (TSV)   2D SDfile   Computed 3D by Vconf -m prep SDfile
Find this compound or compounds like it in BindingDB:
Activity Spreadsheet -- Enzyme Inhibition Constant Data from BindingDB
Found 3 hits for monomerid = 50164468
TargetSodium-dependent serotonin transporter(Homo sapiens (Human))
Columbia University College Of Physicians And Surgeons
Curated by ChEMBL
LigandPNGBDBM50164468(2-(2-Ethylaminomethyl-phenylsulfanyl)-5-methyl-phe...)
Affinity DataKi:  70.2nM. Assay description: In vitro displacement of [3H]-paroxetine from human serotonin transporter expressed in HEK-293 cells
In DepthDetails ArticlePubMed
TargetSodium-dependent dopamine transporter(Homo sapiens (Human))
Columbia University College Of Physicians And Surgeons
Curated by ChEMBL
LigandPNGBDBM50164468(2-(2-Ethylaminomethyl-phenylsulfanyl)-5-methyl-phe...)
Affinity DataKi:  2.12E+3nM. Assay description: In vitro displacement of [3H]-GBR-12,935 from human dopamine transporter expressed in HEK-293 cells
In DepthDetails ArticlePubMed
TargetSodium-dependent noradrenaline transporter(Homo sapiens (Human))
Columbia University College Of Physicians And Surgeons
Curated by ChEMBL
LigandPNGBDBM50164468(2-(2-Ethylaminomethyl-phenylsulfanyl)-5-methyl-phe...)
Affinity DataKi:  7.55E+3nM. Assay description: In vitro displacement of [3H]-nisoxetine from human norepinephrine transporter expressed in HEK-293 cells
In DepthDetails ArticlePubMed