BDBM50164471 5-Methyl-2-(2-propylaminomethyl-phenylsulfanyl)-phenylamine::CHEMBL425010
SMILES CCCNCc1ccccc1Sc1ccc(C)cc1N
InChI Key InChIKey=GZRLZFDDKKLOGM-UHFFFAOYSA-N
Data  3 KI
  Tab Delimited (TSV)   2D SDfile   Computed 3D by Vconf -m prep SDfile
Find this compound or compounds like it in BindingDB:
Activity Spreadsheet -- Enzyme Inhibition Constant Data from BindingDB
Found 3 hits for monomerid = 50164471
TargetSodium-dependent serotonin transporter(Homo sapiens (Human))
Columbia University College Of Physicians And Surgeons
Curated by ChEMBL
LigandPNGBDBM50164471(5-Methyl-2-(2-propylaminomethyl-phenylsulfanyl)-ph...)
Affinity DataKi:  2.18E+3nM. Assay description: In vitro displacement of [3H]-paroxetine from human serotonin transporter expressed in HEK-293 cells
In DepthDetails ArticlePubMed
TargetSodium-dependent dopamine transporter(Homo sapiens (Human))
Columbia University College Of Physicians And Surgeons
Curated by ChEMBL
LigandPNGBDBM50164471(5-Methyl-2-(2-propylaminomethyl-phenylsulfanyl)-ph...)
Affinity DataKi:  3.55E+3nM. Assay description: In vitro displacement of [3H]-GBR-12,935 from human dopamine transporter expressed in HEK-293 cells
In DepthDetails ArticlePubMed
TargetSodium-dependent noradrenaline transporter(Homo sapiens (Human))
Columbia University College Of Physicians And Surgeons
Curated by ChEMBL
LigandPNGBDBM50164471(5-Methyl-2-(2-propylaminomethyl-phenylsulfanyl)-ph...)
Affinity DataKi: >1.00E+4nM. Assay description: In vitro displacement of [3H]-nisoxetine from human norepinephrine transporter expressed in HEK-293 cells
In DepthDetails ArticlePubMed