BDBM50164508 CHEMBL3797321
SMILES [H][C@@]12CN(C[C@@]1(NC(=N)N(C)C2=O)c1ccc(Cl)s1)c1nc(CC)c(F)c(OC)n1
InChI Key InChIKey=ZTDGQYJGQFFPJD-YYSFKGJASA-N
Data  1 KI  1 IC50
  Tab Delimited (TSV)   2D SDfile   Computed 3D by Vconf -m prep SDfile
Find this compound or compounds like it in BindingDB:
Activity Spreadsheet -- Enzyme Inhibition Constant Data from BindingDB
Found 2 hits for monomerid = 50164508
TargetBeta-secretase 1(Homo sapiens (Human))
Merck Research Laboratories
Curated by ChEMBL
LigandPNGBDBM50164508(CHEMBL3797321)
Affinity DataKi:  11nM. Assay description: Inhibition of recombinant human BACE1 preincubated for 30 mins followed QSY7EISEVNLDAEFC-Eu-amide substrate addition measured after 90 mins by FRET a...
In DepthDetails ArticlePubMed
TargetBeta-secretase 1(Homo sapiens (Human))
Merck Research Laboratories
Curated by ChEMBL
LigandPNGBDBM50164508(CHEMBL3797321)
Affinity DataIC50:  203nM. Assay description: Inhibition of BACE1 in human HEK293 cells transfected with human APP Swe/Lon mutations assessed as amyloid beta 40 level after 4 hrs by electrochemil...
In DepthDetails ArticlePubMed