BDBM50164608 (2S)-3'-(2-naphthyl)-2'H-spiro[4-azabicyclo[2.2.2]octane-2,5'-[1,3]oxazolidin]-2'-one::CHEMBL195801
SMILES O=C1O[C@]2(CN1c1ccc3ccccc3c1)CN1CCC2CC1
InChI Key InChIKey=DXKVKYBJBDMPOL-IBGZPJMESA-N
Data  1 KI
  Tab Delimited (TSV)   2D SDfile   Computed 3D by Vconf -m prep SDfile
Find this compound or compounds like it in BindingDB:
Activity Spreadsheet -- Enzyme Inhibition Constant Data from BindingDB
Found 1 hit for monomerid = 50164608
TargetNeuronal acetylcholine receptor subunit alpha-7(Rattus norvegicus (Rat))
Mitsubishi Pharma
Curated by ChEMBL
LigandPNGBDBM50164608((2S)-3'-(2-naphthyl)-2'H-spiro[4-azabicyclo[2.2.2]...)
Affinity DataKi:  205nM. Assay description: Inhibition of [125I]alpha-bungarotoxin binding to rat nicotinic acetylcholine receptor alpha7
In DepthDetails ArticlePubMed