BDBM50164611 (2R)-3'-(5-ethylthien-2-yl)-2'H-spiro[4-azabicyclo[2.2.2]octane-2,5'-[1,3]oxazolidin]-2'-one::CHEMBL371114
SMILES CCc1ccc(s1)N1C[C@@]2(CN3CCC2CC3)OC1=O
InChI Key InChIKey=DRUIBUDSFOPOFK-OAHLLOKOSA-N
Data  1 KI
  Tab Delimited (TSV)   2D SDfile   Computed 3D by Vconf -m prep SDfile
Find this compound or compounds like it in BindingDB:
Activity Spreadsheet -- Enzyme Inhibition Constant Data from BindingDB
Found 1 hit for monomerid = 50164611
TargetNeuronal acetylcholine receptor subunit alpha-7(Rattus norvegicus (Rat))
Mitsubishi Pharma
Curated by ChEMBL
LigandPNGBDBM50164611((2R)-3'-(5-ethylthien-2-yl)-2'H-spiro[4-azabicyclo...)
Affinity DataKi:  21nM. Assay description: Inhibition of [125I]alpha-bungarotoxin binding to rat nicotinic acetylcholine receptor alpha7
In DepthDetails ArticlePubMed