BDBM50164619 5-[(2R)-2'-oxo-3'H-spiro[4-azabicyclo[2.2.2]octane-2,5'-[1,3]oxazolidin]-3'-yl]thiophene-2-carbonitrile::CHEMBL189370
SMILES O=C1O[C@@]2(CN1c1ccc(s1)C#N)CN1CCC2CC1
InChI Key InChIKey=XCKMJEYATWSYHX-CQSZACIVSA-N
Data  1 KI
  Tab Delimited (TSV)   2D SDfile   Computed 3D by Vconf -m prep SDfile
Find this compound or compounds like it in BindingDB:
Activity Spreadsheet -- Enzyme Inhibition Constant Data from BindingDB
Found 1 hit for monomerid = 50164619
TargetNeuronal acetylcholine receptor subunit alpha-7(Rattus norvegicus (Rat))
Mitsubishi Pharma
Curated by ChEMBL
LigandPNGBDBM50164619(5-[(2R)-2'-oxo-3'H-spiro[4-azabicyclo[2.2.2]octane...)
Affinity DataKi:  85nM. Assay description: Inhibition of [125I]alpha-bungarotoxin binding to rat nicotinic acetylcholine receptor alpha7
In DepthDetails ArticlePubMed