BDBM50164622 (2R)-3'-(1-benzothien-2-yl)-2'H-spiro[4-azabicyclo[2.2.2]octane-2,5'-[1,3]oxazolidin]-2'-one::CHEMBL192237
SMILES O=C1O[C@@]2(CN1c1cc3ccccc3s1)CN1CCC2CC1
InChI Key InChIKey=BHNZNEIADWVYEY-QGZVFWFLSA-N
Data  2 KI
  Tab Delimited (TSV)   2D SDfile   Computed 3D by Vconf -m prep SDfile
Find this compound or compounds like it in BindingDB:
Activity Spreadsheet -- Enzyme Inhibition Constant Data from BindingDB
Found 2 hits for monomerid = 50164622
TargetNeuronal acetylcholine receptor subunit alpha-7(Rattus norvegicus (Rat))
Mitsubishi Pharma
Curated by ChEMBL
LigandPNGBDBM50164622((2R)-3'-(1-benzothien-2-yl)-2'H-spiro[4-azabicyclo...)
Affinity DataKi:  75nM. Assay description: Inhibition of [125I]alpha-bungarotoxin binding to rat nicotinic acetylcholine receptor alpha7
In DepthDetails ArticlePubMed
TargetNeuronal acetylcholine receptor subunit alpha-7(Homo sapiens (Human))
Targacept
Curated by ChEMBL
LigandPNGBDBM50164622((2R)-3'-(1-benzothien-2-yl)-2'H-spiro[4-azabicyclo...)
Affinity DataKi:  75nM. Assay description: Binding affinity to alpha7 nAChR
In DepthDetails ArticlePubMed