BDBM501653 US11028054, Example 39
SMILES Cc1nc2c(cc(cc2[nH]1)-c1ccc(cc1)-c1cccc(CNC(C)(C)C)c1)C(O)=O
InChI Key InChIKey=JCOXCVNMQQFGLM-UHFFFAOYSA-N
Data  1 IC50
  Tab Delimited (TSV)   2D SDfile   Computed 3D by Vconf -m prep SDfile
Find this compound or compounds like it in BindingDB:
Activity Spreadsheet -- Enzyme Inhibition Constant Data from BindingDB
Found 1 hit for monomerid = 501653
TargetDihydroorotate dehydrogenase (quinone), mitochondrial(Homo sapiens (Human))
Merck Patent
US Patent
LigandPNGBDBM501653(US11028054, Example 39)
Affinity DataIC50:  55nM. Assay description: Reagents used: L-Dihydroorotic acid, Sigma, D7128, 2,6-Dichloroindophenol sodium salt hydrate, sigma, D1878 Dimethyl sulfoxide (DMSO), spectroscopic ...
Ligand InfoPC cidPC sid
In DepthDetails US Patent