BDBM50165368 CHEMBL191633::Dodecanedioic acid mono-((2S,3aR,4S,6S,6aR,7S,9bS)-6-acetoxy-3,3a-dihydroxy-3,6,9-trimethyl-7-octanoyloxy-2,8-dioxo-2,3,3a,4,5,6,6a,7,8,9b-decahydro-azuleno[4,5-b]furan-4-yl) ester
SMILES CCCCCCCC(=O)O[C@H]1[C@H]2C([C@@H]3OC(=O)[C@@](C)(O)[C@@]3(O)[C@H](C[C@]2(C)OC(C)=O)OC(=O)CCCCCCCCCCC(O)=O)=C(C)C1=O
InChI Key InChIKey=OBLSMXDPUDCTJW-LSSXTPTNSA-N
Data  1 IC50
  Tab Delimited (TSV)   2D SDfile   Computed 3D by Vconf -m prep SDfile
Find this compound or compounds like it in BindingDB:
Activity Spreadsheet -- Enzyme Inhibition Constant Data from BindingDB
Found 1 hit for monomerid = 50165368
TargetSarcoplasmic/endoplasmic reticulum calcium ATPase 1(Homo sapiens (Human))
Johns Hopkins University
Curated by ChEMBL
LigandPNGBDBM50165368(CHEMBL191633 | Dodecanedioic acid mono-((2S,3aR,4S...)
Affinity DataIC50:  2.08nM. Assay description: Inhibitory activity against sarco- endoplasmic reticulum calcium-ATPase
In DepthDetails ArticlePubMed