BDBM50165471 CHEMBL196507::Cyclopropanecarboxylic acid [3-(4-oxo-3,4-dihydro-phthalazin-1-ylmethyl)-phenyl]-amide::N-(3-((4-oxo-3,4-dihydrophthalazin-1-yl)methyl)phenyl)cyclopropanecarboxamide
SMILES O=C(Nc1cccc(Cc2n[nH]c(=O)c3ccccc23)c1)C1CC1
InChI Key InChIKey=DZEPNNZXCOUGMX-UHFFFAOYSA-N
Data  2 IC50
  Tab Delimited (TSV)   2D SDfile   Computed 3D by Vconf -m prep SDfile
Find this compound or compounds like it in BindingDB:
Activity Spreadsheet -- Enzyme Inhibition Constant Data from BindingDB
Found 2 hits for monomerid = 50165471
TargetPoly [ADP-ribose] polymerase 1(Homo sapiens (Human))
Huazhong University Of Science And Technology
Curated by ChEMBL
LigandPNGBDBM50165471(CHEMBL196507 | Cyclopropanecarboxylic acid [3-(4-o...)
Affinity DataIC50:  55nM. Assay description: Inhibition of human recombinant PARP1
In DepthDetails ArticlePubMed
TargetPoly [ADP-ribose] polymerase 1(Homo sapiens (Human))
Huazhong University Of Science And Technology
Curated by ChEMBL
LigandPNGBDBM50165471(CHEMBL196507 | Cyclopropanecarboxylic acid [3-(4-o...)
Affinity DataIC50:  55nM. Assay description: Inhibitory concentration against human poly (ADP-ribose) polymerase 1 (PARP-1)
In DepthDetails ArticlePubMed