BDBM50166029 CHEMBL192650::Naphthalene-2-carboxylic acid [4-((R)-10-methoxy-1,2,4,4a,5,6-hexahydro-pyrazino[1,2-a]quinolin-3-yl)-butyl]-amide
SMILES COc1cccc2CC[C@@H]3CN(CCCCNC(=O)c4ccc5ccccc5c4)CCN3c12
InChI Key InChIKey=XLHPOAMYVQMRPZ-RUZDIDTESA-N
Data  3 KI
  Tab Delimited (TSV)   2D SDfile   Computed 3D by Vconf -m prep SDfile
Find this compound or compounds like it in BindingDB:
Activity Spreadsheet -- Enzyme Inhibition Constant Data from BindingDB
Found 3 hits for monomerid = 50166029
TargetD(3) dopamine receptor(Rattus norvegicus (Rat))
University Of Michigan
Curated by ChEMBL
LigandPNGBDBM50166029(CHEMBL192650 | Naphthalene-2-carboxylic acid [4-((...)
Affinity DataKi:  4.10nM. Assay description: Inhibition of [3H]-PD 128907 binding to Dopamine receptor D3 in rat ventral striatum
In DepthDetails ArticlePubMed
TargetD(4) dopamine receptor(RAT)
University Of Michigan
Curated by ChEMBL
LigandPNGBDBM50166029(CHEMBL192650 | Naphthalene-2-carboxylic acid [4-((...)
Affinity DataKi:  312nM. Assay description: Inhibition of [3H]-Spiperone binding to Dopamine receptor D2-like in rat caudate-putamen membrane
In DepthDetails ArticlePubMed
TargetD(1B) dopamine receptor(RAT)
University Of Michigan
Curated by ChEMBL
LigandPNGBDBM50166029(CHEMBL192650 | Naphthalene-2-carboxylic acid [4-((...)
Affinity DataKi:  7.59E+3nM. Assay description: Inhibition of [3H]-SCH- 23390 binding to Dopamine receptor D1-like in rat brain
In DepthDetails ArticlePubMed