BDBM50167009 2-(4-Methyl-piperazin-1-yl)-3-propyl-quinoline-4-carboxylic acid diethylamide::CHEMBL193318
SMILES CCCc1c(nc2ccccc2c1C(=O)N(CC)CC)N1CCN(C)CC1
InChI Key InChIKey=GQUKZMKYVNVNKR-UHFFFAOYSA-N
Data  1 KI
  Tab Delimited (TSV)   2D SDfile   Computed 3D by Vconf -m prep SDfile
Find this compound or compounds like it in BindingDB:
Activity Spreadsheet -- Enzyme Inhibition Constant Data from BindingDB
Found 1 hit for monomerid = 50167009
Target5-hydroxytryptamine receptor 3A/3B(Rattus norvegicus)
Universit£
Curated by ChEMBL
LigandPNGBDBM50167009(2-(4-Methyl-piperazin-1-yl)-3-propyl-quinoline-4-c...)
Affinity DataKi:  0.920nM. Assay description: Displacement of [3H]granisetron from 5-hydroxytryptamine 3 receptor of rat cortical membrane
In DepthDetails ArticlePubMed